Reaction Details
TargetMu-type opioid receptor
LigandBDBM50248793
Substrate/Competitorn/a
Meas. Tech.ChEMBL_543310 (CHEMBL1019447)
EC50 1.8±n/a nM
Citation Cami-Kobeci, GNeal, APBradbury, FAPurington, LCAceto, MDHarris, LSLewis, JWTraynor, JRHusbands, SM Mixed kappa/mu opioid receptor agonists: the 6 beta-naltrexamines. J Med Chem52:1546-52 (2009) 
 
Mu-type opioid receptor
Name:Mu-type opioid receptor
Type:G Protein-Coupled Receptor (GPCR)
Mol. Mass.:44503.11
Organism:Rattus norvegicus (rat)
Description:Competition binding assays were carried out using membrane preparations from transfected HN9.10 cells that constitutively expressed the mu opioid receptor.
Residue:398
BDBM50248793
NameBDBM50248793
Synonyms:17-Cyclopropylmethyl-3,14beta-dihydroxy-4,5alpha-epoxy-6beta-(cinnamoylamino)morphinan | CHEMBL473362
TypeSmall organic molecule
Emp. Form.C29H32N2O4
Mol. Mass.472.5754
SMILESOc1ccc2C[C@H]3N(CC4CC4)CC[C@@]45[C@@H](Oc1c24)[C@@H](CC[C@@]35O)NC(=O)\C=C\c1ccccc1