Reaction Details
TargetMu-type opioid receptor
LigandBDBM50248827
Substrate/Competitorn/a
Meas. Tech.ChEMBL_543308 (CHEMBL1019445)
Ki 0.16±n/a nM
Citation Cami-Kobeci, GNeal, APBradbury, FAPurington, LCAceto, MDHarris, LSLewis, JWTraynor, JRHusbands, SM Mixed kappa/mu opioid receptor agonists: the 6 beta-naltrexamines. J Med Chem52:1546-52 (2009) 
 
Mu-type opioid receptor
Name:Mu-type opioid receptor
Type:G Protein-Coupled Receptor (GPCR)
Mol. Mass.:44503.11
Organism:Rattus norvegicus (rat)
Description:Competition binding assays were carried out using membrane preparations from transfected HN9.10 cells that constitutively expressed the mu opioid receptor.
Residue:398
BDBM50248827
NameBDBM50248827
Synonyms:(2E)-N-[(1S,5R,13R,14R,17S)-17-(benzyloxy)-4-(cyclopropylmethyl)-10-hydroxy-12-oxa-4-azapentacyclo[9.6.1.0^{1,13}.0^{5,17}.0^{7,18}]octadeca-7(18),8,10-trien-14-yl]-3-phenylprop-2-enamide | CHEMBL509552
TypeSmall organic molecule
Emp. Form.C36H38N2O4
Mol. Mass.562.6979
SMILESOc1ccc2C[C@H]3N(CC4CC4)CC[C@@]45[C@@H](Oc1c24)[C@@H](CC[C@@]35OCc1ccccc1)NC(=O)\C=C\c1ccccc1