Reaction Details
TargetTyrosine-protein kinase SYK
LigandBDBM50132449
Substrate/Competitorn/a
Meas. Tech.ChEMBL_499518 (CHEMBL1022010)
IC50 133±n/a nM
Citation Xie, HZLi, LLRen, JXZou, JYang, LWei, YQYang, SY Pharmacophore modeling study based on known spleen tyrosine kinase inhibitors together with virtual screening for identifying novel inhibitors. Bioorg Med Chem Lett19:1944-9 (2009) 
 
Tyrosine-protein kinase SYK
Name:Tyrosine-protein kinase SYK
Type:Enzyme
Mol. Mass.:72079.99
Organism:Homo sapiens (Human)
Description:P43405
Residue:635
BDBM50132449
NameBDBM50132449
Synonyms:3-((1-(4-morpholino-4-oxobutyl)-1H-indol-3-yl)methylene)-2-oxoindoline-5-sulfonamide CHEMBL322152
TypeSmall organic molecule
Emp. Form.C25H26N4O5S
Mol. Mass.494.563
SMILESNS(=O)(=O)c1ccc2NC(=O)\C(=C/c3cn(CCCC(=O)N4CCOCC4)c4ccccc34)c2c1