Reaction Details
TargetTyrosine-protein kinase SYK
LigandBDBM50132451
Substrate/Competitorn/a
Meas. Tech.ChEMBL_499518 (CHEMBL1022010)
IC50 145±n/a nM
Citation Xie, HZLi, LLRen, JXZou, JYang, LWei, YQYang, SY Pharmacophore modeling study based on known spleen tyrosine kinase inhibitors together with virtual screening for identifying novel inhibitors. Bioorg Med Chem Lett19:1944-9 (2009) 
 
Tyrosine-protein kinase SYK
Name:Tyrosine-protein kinase SYK
Type:Enzyme
Mol. Mass.:72079.99
Organism:Homo sapiens (Human)
Description:P43405
Residue:635
BDBM50132451
NameBDBM50132451
Synonyms:3-((5-methoxy-1-methyl-1H-indol-3-yl)methylene)-N-methyl-2-oxoindoline-5-carboxamide CHEMBL318079
TypeSmall organic molecule
Emp. Form.C21H19N3O3
Mol. Mass.361.3939
SMILESCNC(=O)c1ccc2NC(=O)\C(=C/c3cn(C)c4ccc(OC)cc34)c2c1