Reaction Details
TargetTyrosine-protein kinase SYK
LigandBDBM50132444
Substrate/Competitorn/a
Meas. Tech.ChEMBL_499518 (CHEMBL1022010)
IC50 678±n/a nM
Citation Xie, HZLi, LLRen, JXZou, JYang, LWei, YQYang, SY Pharmacophore modeling study based on known spleen tyrosine kinase inhibitors together with virtual screening for identifying novel inhibitors. Bioorg Med Chem Lett19:1944-9 (2009) 
 
Tyrosine-protein kinase SYK
Name:Tyrosine-protein kinase SYK
Type:Enzyme
Mol. Mass.:72079.99
Organism:Homo sapiens (Human)
Description:P43405
Residue:635
BDBM50132444
NameBDBM50132444
Synonyms:5-{5-Methoxy-3-[2-oxo-5-sulfamoyl-1,2-dihydro-indol-(3Z)-ylidenemethyl]-indol-1-yl}-pentanoic acid ethyl ester ethyl 5-(5-methoxy-3-((2-oxo-5-sulfamoylindolin-3-ylidene)methyl)-1H-indol-1-yl)pentanoate
TypeSmall organic molecule
Emp. Form.C25H27N3O6S
Mol. Mass.497.563
SMILESCCOC(=O)CCCCn1cc(\C=C2/C(=O)Nc3ccc(cc23)S(N)(=O)=O)c2cc(OC)ccc12