Reaction Details
TargetTyrosine-protein kinase SYK
LigandBDBM50132441
Substrate/Competitorn/a
Meas. Tech.ChEMBL_499518 (CHEMBL1022010)
IC50 60±n/a nM
Citation Xie, HZLi, LLRen, JXZou, JYang, LWei, YQYang, SY Pharmacophore modeling study based on known spleen tyrosine kinase inhibitors together with virtual screening for identifying novel inhibitors. Bioorg Med Chem Lett19:1944-9 (2009) 
 
Tyrosine-protein kinase SYK
Name:Tyrosine-protein kinase SYK
Type:Enzyme
Mol. Mass.:72079.99
Organism:Homo sapiens (Human)
Description:P43405
Residue:635
BDBM50132441
NameBDBM50132441
Synonyms:3-(3-((5-methoxy-1-methyl-1H-indol-3-yl)methylene)-2-oxoindoline-5-sulfonamido)propanamide CHEMBL105427
TypeSmall organic molecule
Emp. Form.C22H22N4O5S
Mol. Mass.454.499
SMILESCOc1ccc2n(C)cc(\C=C3/C(=O)Nc4ccc(cc34)S(=O)(=O)NCCC(N)=O)c2c1