Reaction Details
TargetTyrosine-protein kinase SYK
LigandBDBM50249222
Substrate/Competitorn/a
Meas. Tech.ChEMBL_499518 (CHEMBL1022010)
IC50 1.6±n/a nM
Citation Xie, HZLi, LLRen, JXZou, JYang, LWei, YQYang, SY Pharmacophore modeling study based on known spleen tyrosine kinase inhibitors together with virtual screening for identifying novel inhibitors. Bioorg Med Chem Lett19:1944-9 (2009) 
 
Tyrosine-protein kinase SYK
Name:Tyrosine-protein kinase SYK
Type:Enzyme
Mol. Mass.:72079.99
Organism:Homo sapiens (Human)
Description:P43405
Residue:635
BDBM50249222
NameBDBM50249222
Synonyms:5-((2R)-2-aminocycloheptylamino)-7-(3,5-dimethoxyphenylamino)imidazo[1,2-c]pyrimidine-8-carboxamide | CHEMBL515910
TypeSmall organic molecule
Emp. Form.C22H29N7O3
Mol. Mass.439.5108
SMILESCOc1cc(Nc2nc(NC3CCCCC[C@H]3N)n3ccnc3c2C(N)=O)cc(OC)c1