Reaction Details
TargetTyrosine-protein kinase SYK
LigandBDBM50249508
Substrate/Competitorn/a
Meas. Tech.ChEMBL_499518 (CHEMBL1022010)
IC50 2.5±n/a nM
Citation Xie, HZLi, LLRen, JXZou, JYang, LWei, YQYang, SY Pharmacophore modeling study based on known spleen tyrosine kinase inhibitors together with virtual screening for identifying novel inhibitors. Bioorg Med Chem Lett19:1944-9 (2009) 
 
Tyrosine-protein kinase SYK
Name:Tyrosine-protein kinase SYK
Type:Enzyme
Mol. Mass.:72079.99
Organism:Homo sapiens (Human)
Description:P43405
Residue:635
BDBM50249508
NameBDBM50249508
Synonyms:5-(((2R)-2-aminocyclohexyl)methyl)-7-(3,5-dimethylphenylamino)imidazo[1,2-c]pyrimidine-8-carboxamide | CHEMBL504558
TypeSmall organic molecule
Emp. Form.C22H28N6O
Mol. Mass.392.4973
SMILESCc1cc(C)cc(Nc2nc(CC3CCCC[C@H]3N)n3ccnc3c2C(N)=O)c1