Reaction Details
Target5-hydroxytryptamine receptor 4
LigandBDBM50413544
Substrate/Competitorn/a
Meas. Tech.ChEMBL_564555 (CHEMBL963182)
Ki 9.55±n/a nM
Citation Lemaître, SLepailleur, ABureau, RButt-Gueulle, SLelong-Boulouard, VDuchatelle, PBoulouard, MDumuis, ADaveu, CLezoualc'h, FPfeiffer, BDauphin, FRault, S Novel antagonists of serotonin-4 receptors: synthesis and biological evaluation of pyrrolothienopyrazines. Bioorg Med Chem17:2607-22 (2009) 
 
5-hydroxytryptamine receptor 4
Name:5-hydroxytryptamine receptor 4
Type:Enzyme Catalytic Domain
Mol. Mass.:43735.29
Organism:GUINEA PIG
Description:5-HT4 HTR4 GUINEA PIG::O70528
Residue:388
BDBM50413544
NameBDBM50413544
Synonyms:CHEMBL511794
TypeSmall organic molecule
Emp. Form.C18H23N3OS
Mol. Mass.329.46
SMILESCCN1CCC(COc2nc3scc(C)c3n3cccc23)CC1