Reaction Details
TargetCholecystokinin receptor type A
LigandBDBM50278373
Substrate/Competitorn/a
Meas. Tech.ChEMBL_564596 (CHEMBL964036)
IC50 11400±n/a nM
Citation Lassiani, LPavan, MVBerti, FKokotos, GMarkidis, TMennuni, LMakovec, FVarnavas, A Anthranilic acid based CCK1 receptor antagonists: blocking the receptor with the same 'words' of the endogenous ligand. Bioorg Med Chem17:2336-50 (2009) 
 
Cholecystokinin receptor type A
Name:Cholecystokinin receptor type A
Type:n/a
Mol. Mass.:48229.77
Organism:Cavia porcellus
Description:n/a
Residue:430
BDBM50278373
NameBDBM50278373
Synonyms:2(R)-{2-[(1H-Indole-2-carbonyl)-amino]-benzoylamino}-4-methylsulfanyl-butyric acid | CHEMBL472079
TypeSmall organic molecule
Emp. Form.C21H21N3O4S
Mol. Mass.411.474
SMILESCSCC[C@@H](NC(=O)c1ccccc1NC(=O)c1cc2ccccc2[nH]1)C(O)=O