Reaction Details
TargetDipeptidyl peptidase 4
LigandBDBM50249053
Substrate/Competitorn/a
Meas. Tech.ChEMBL_541610 (CHEMBL1011700)
IC50 15±n/a nM
Citation Tsai, TYHsu, TChen, CTCheng, JHYeh, TKChen, XHuang, CYChang, CNYeh, KCHsieh, SHChien, CHChang, YWHuang, CHHuang, YWHuang, CLWu, SHWang, MHLu, CTChao, YSJiaang, WT Novel trans-2-aryl-cyclopropylamine analogues as potent and selective dipeptidyl peptidase IV inhibitors. Bioorg Med Chem17:2388-99 (2009) 
 
Dipeptidyl peptidase 4
Name:Dipeptidyl peptidase 4
Type:Enzyme
Mol. Mass.:88271.01
Organism:Homo sapiens (Human)
Description:P27487
Residue:766
BDBM50249053
NameBDBM50249053
Synonyms:3-({2-[(2S),4-2S-Cyano-4-fluoropyrrolidin-1-yl]-2-oxoethyl}-amino)-3-methyl-N-[trans-2-(4-methyl-1,3-thiazol-5-yl)cyclopropyl]butanamide | CHEMBL474767
TypeSmall organic molecule
Emp. Form.C19H26FN5O2S
Mol. Mass.407.505
SMILESCc1ncsc1[C@H]1C[C@@H]1NC(=O)CC(C)(C)NCC(=O)N1C[C@@H](F)C[C@H]1C#N