Reaction Details
TargetDipeptidyl peptidase 2
LigandBDBM11162
Substrate/Competitorn/a
Meas. Tech.ChEMBL_541592 (CHEMBL1011681)
IC50>20000±n/a nM
Citation Tsai, TYHsu, TChen, CTCheng, JHYeh, TKChen, XHuang, CYChang, CNYeh, KCHsieh, SHChien, CHChang, YWHuang, CHHuang, YWHuang, CLWu, SHWang, MHLu, CTChao, YSJiaang, WT Novel trans-2-aryl-cyclopropylamine analogues as potent and selective dipeptidyl peptidase IV inhibitors. Bioorg Med Chem17:2388-99 (2009) 
 
Dipeptidyl peptidase 2
Name:Dipeptidyl peptidase 2
Type:Protein
Mol. Mass.:54339.29
Organism:Homo sapiens (Human)
Description:Q9UHL4
Residue:492
BDBM11162
NameBDBM11162
Synonyms:(1R)-3-oxo-3-[3-(trifluoroethyl)-5,6-dihydro[1,2,4]triazolo[4,3-a]pyrazin-7(8H)-yl]-1-(2,4,5-trifluorobenzyl)propylamine CHEMBL393336 Sitagliptin Triazolopiperazine Analogue 1 | US10479798, Compound MK0431
TypeSmall organic molecule
Emp. Form.C16H15F6N5O
Mol. Mass.407.3136
SMILESN[C@@H](CC(=O)N1CCn2c(C1)nnc2C(F)(F)F)Cc1cc(F)c(F)cc1F