Reaction Details
TargetDipeptidyl peptidase 4
LigandBDBM50248620
Substrate/Competitorn/a
Meas. Tech.ChEMBL_541590 (CHEMBL1011679)
IC50 19±n/a nM
Citation Tsai, TYHsu, TChen, CTCheng, JHYeh, TKChen, XHuang, CYChang, CNYeh, KCHsieh, SHChien, CHChang, YWHuang, CHHuang, YWHuang, CLWu, SHWang, MHLu, CTChao, YSJiaang, WT Novel trans-2-aryl-cyclopropylamine analogues as potent and selective dipeptidyl peptidase IV inhibitors. Bioorg Med Chem17:2388-99 (2009) 
 
Dipeptidyl peptidase 4
Name:Dipeptidyl peptidase 4
Type:Enzyme
Mol. Mass.:88271.01
Organism:Homo sapiens (Human)
Description:P27487
Residue:766
BDBM50248620
NameBDBM50248620
Synonyms:3-({2-[(2S,4S)-2-Cyano-4-fluoropyrrolidin-1-yl]-2-oxoethyl}amino)-3-methyl-N-[(1S,2R)-2-phenylcyclopropyl]butanamide | CHEMBL464092
TypeSmall organic molecule
Emp. Form.C21H27FN4O2
Mol. Mass.386.4631
SMILESCC(C)(CC(=O)N[C@H]1C[C@@H]1c1ccccc1)NCC(=O)N1C[C@@H](F)C[C@H]1C#N