Reaction Details
TargetPhospholipase D1
LigandBDBM50257542
Substrate/Competitorn/a
Meas. Tech.ChEMBL_566795 (CHEMBL957604)
IC50 2±n/a nM
Citation Lewis, JAScott, SALavieri, RBuck, JRSelvy, PEStoops, SLArmstrong, MDBrown, HALindsley, CW Design and synthesis of isoform-selective phospholipase D (PLD) inhibitors. Part I: Impact of alternative halogenated privileged structures for PLD1 specificity. Bioorg Med Chem Lett19:1916-20 (2009) 
 
Phospholipase D1
Name:Phospholipase D1
Type:Protein
Mol. Mass.:124219.92
Organism:Homo sapiens (Human)
Description:Q13393
Residue:1074
BDBM50257542
NameBDBM50257542
Synonyms:(S)-N-(1-(4-(6-fluoro-2-oxo-2,3-dihydro-1H-benzo[d]imidazol-1-yl)piperidin-1-yl)propan-2-yl)-2-naphthamide | CHEMBL493521
TypeSmall organic molecule
Emp. Form.C26H27FN4O2
Mol. Mass.446.5166
SMILESC[C@@H](CN1CCC(CC1)n1c2cc(F)ccc2[nH]c1=O)NC(=O)c1ccc2ccccc2c1