Reaction Details
TargetHistone deacetylase 11
LigandBDBM50278515
Substrate/Competitorn/a
Meas. Tech.ChEMBL_564623 (CHEMBL964063)
IC50>50000±n/a nM
Citation Heidebrecht, RWChenard, MClose, JDahlberg, WKFleming, JGrimm, JBHamill, JEHarsch, AHaines, BBHughes, BKral, AMMiddleton, REMushti, COzerova, NSzewczak, AAWang, HWilson, KWitter, DJSecrist, JPMiller, TA Exploring the pharmacokinetic properties of phosphorus-containing selective HDAC 1 and 2 inhibitors (SHI-1:2). Bioorg Med Chem Lett19:2053-8 (2009) 
 
Histone deacetylase 11
Name:Histone deacetylase 11
Type:Chromatin regulator; hydrolase; repressor
Mol. Mass.:39187.66
Organism:Homo sapiens (Human)
Description:Q96DB2
Residue:347
BDBM50278515
NameBDBM50278515
Synonyms:CHEMBL470225 | diethyl(4-(2-amino-5-(thiophen-2-yl)phenylcarbamoyl)benzylamino)methylphosphonate
TypeSmall organic molecule
Emp. Form.C23H28N3O4PS
Mol. Mass.473.525
SMILESCCOP(=O)(CNCc1ccc(cc1)C(=O)Nc1cc(ccc1N)-c1cccs1)OCC