Reaction Details
TargetHistone deacetylase 1
LigandBDBM50278469
Substrate/Competitorn/a
Meas. Tech.ChEMBL_564614 (CHEMBL964054)
IC50 54±n/a nM
Citation Heidebrecht, RWChenard, MClose, JDahlberg, WKFleming, JGrimm, JBHamill, JEHarsch, AHaines, BBHughes, BKral, AMMiddleton, REMushti, COzerova, NSzewczak, AAWang, HWilson, KWitter, DJSecrist, JPMiller, TA Exploring the pharmacokinetic properties of phosphorus-containing selective HDAC 1 and 2 inhibitors (SHI-1:2). Bioorg Med Chem Lett19:2053-8 (2009) 
 
Histone deacetylase 1
Name:Histone deacetylase 1
Type:Enzyme
Mol. Mass.:55090.27
Organism:Homo sapiens (Human)
Description:Q13547
Residue:482
BDBM50278469
NameBDBM50278469
Synonyms:CHEMBL469378 | methyl 4-(2-amino-5-(thiophen-2-yl)phenylcarbamoyl)benzyl(methyl)phosphinate
TypeSmall organic molecule
Emp. Form.C20H21N2O3PS
Mol. Mass.400.431
SMILESCOP(C)(=O)Cc1ccc(cc1)C(=O)Nc1cc(ccc1N)-c1cccs1