Reaction Details
Target5-hydroxytryptamine receptor 2C
LigandBDBM50257610
Substrate/Competitorn/a
Meas. Tech.ChEMBL_567049 (CHEMBL1029957)
Ki 382±n/a nM
Citation Fish, PVBrown, ADEvrard, ERoberts, LR 7-Sulfonamido-3-benzazepines as potent and selective 5-HT2C receptor agonists: hit-to-lead optimization. Bioorg Med Chem Lett19:1871-5 (2009) 
 
5-hydroxytryptamine receptor 2C
Name:5-hydroxytryptamine receptor 2C
Type:G Protein-Coupled Receptor (GPCR)
Mol. Mass.:51836.79
Organism:Homo sapiens (Human)
Description:P28335
Residue:458
BDBM50257610
NameBDBM50257610
Synonyms:CHEMBL493152 | N-phenyl-2,3,4,5-tetrahydro-1H-benzo[d]azepine-7-sulfonamide
TypeSmall organic molecule
Emp. Form.C16H18N2O2S
Mol. Mass.302.391
SMILESO=S(=O)(Nc1ccccc1)c1ccc2CCNCCc2c1