Reaction Details
Target5-hydroxytryptamine receptor 2C
LigandBDBM50257569
Substrate/Competitorn/a
Meas. Tech.ChEMBL_566811 (CHEMBL957620)
EC50 12±n/a nM
Citation Fish, PVBrown, ADEvrard, ERoberts, LR 7-Sulfonamido-3-benzazepines as potent and selective 5-HT2C receptor agonists: hit-to-lead optimization. Bioorg Med Chem Lett19:1871-5 (2009) 
 
5-hydroxytryptamine receptor 2C
Name:5-hydroxytryptamine receptor 2C
Type:G Protein-Coupled Receptor (GPCR)
Mol. Mass.:51836.79
Organism:Homo sapiens (Human)
Description:P28335
Residue:458
BDBM50257569
NameBDBM50257569
Synonyms:7-(3-(3-chlorophenoxy)azetidin-1-ylsulfonyl)-2,3,4,5-tetrahydro-1H-benzo[d]azepine | CHEMBL493757
TypeSmall organic molecule
Emp. Form.C19H21ClN2O3S
Mol. Mass.392.9
SMILESClc1cccc(OC2CN(C2)S(=O)(=O)c2ccc3CCNCCc3c2)c1