Reaction Details
Target5-hydroxytryptamine receptor 2B
LigandBDBM50257568
Substrate/Competitorn/a
Meas. Tech.ChEMBL_567051 (CHEMBL1029959)
EC50>9940±n/a nM
Citation Fish, PVBrown, ADEvrard, ERoberts, LR 7-Sulfonamido-3-benzazepines as potent and selective 5-HT2C receptor agonists: hit-to-lead optimization. Bioorg Med Chem Lett19:1871-5 (2009) 
 
5-hydroxytryptamine receptor 2B
Name:5-hydroxytryptamine receptor 2B
Type:G Protein-Coupled Receptor (GPCR)
Mol. Mass.:54312.47
Organism:Homo sapiens (Human)
Description:Receptor binding assays were performed using human clone stably expressed in CHO cells.
Residue:481
BDBM50257568
NameBDBM50257568
Synonyms:7-(3-(2-chlorophenoxy)azetidin-1-ylsulfonyl)-2,3,4,5-tetrahydro-1H-benzo[d]azepine | CHEMBL524171
TypeSmall organic molecule
Emp. Form.C19H21ClN2O3S
Mol. Mass.392.9
SMILESClc1ccccc1OC1CN(C1)S(=O)(=O)c1ccc2CCNCCc2c1