Reaction Details
TargetDipeptidyl peptidase 4
LigandBDBM50256765
Substrate/Competitorn/a
Meas. Tech.ChEMBL_567091 (CHEMBL1030770)
IC50 9±n/a nM
Citation Tsai, TYHsu, TChen, CTCheng, JHChiou, MCHuang, CHTseng, YJYeh, TKHuang, CYYeh, KCHuang, YWWu, SHWang, MHChen, XChao, YSJiaang, WT Rational design and synthesis of potent and long-lasting glutamic acid-based dipeptidyl peptidase IV inhibitors. Bioorg Med Chem Lett19:1908-12 (2009) 
 
Dipeptidyl peptidase 4
Name:Dipeptidyl peptidase 4
Type:Enzyme
Mol. Mass.:88271.01
Organism:Homo sapiens (Human)
Description:P27487
Residue:766
BDBM50256765
NameBDBM50256765
Synonyms:(S)-1-((S)-2-cyanopyrrolidin-1-yl)-1,5-dioxo-5-(2-(trifluoromethyl)-5,6-dihydro-[1,2,4]triazolo[1,5-a]pyrazin-7(8H)-yl)pentan-2-aminium 2,2,2-trifluoroacetate | CHEMBL474047
TypeSmall organic molecule
Emp. Form.C16H21F3N7O2
Mol. Mass.400.3783
SMILES[NH3+][C@@H](CCC(=O)N1CCn2nc(nc2C1)C(F)(F)F)C(=O)N1CCC[C@H]1C#N