Reaction Details
TargetDipeptidyl peptidase 4
LigandBDBM50256830
Substrate/Competitorn/a
Meas. Tech.ChEMBL_567091 (CHEMBL1030770)
IC50 7±n/a nM
Citation Tsai, TYHsu, TChen, CTCheng, JHChiou, MCHuang, CHTseng, YJYeh, TKHuang, CYYeh, KCHuang, YWWu, SHWang, MHChen, XChao, YSJiaang, WT Rational design and synthesis of potent and long-lasting glutamic acid-based dipeptidyl peptidase IV inhibitors. Bioorg Med Chem Lett19:1908-12 (2009) 
 
Dipeptidyl peptidase 4
Name:Dipeptidyl peptidase 4
Type:Enzyme
Mol. Mass.:88271.01
Organism:Homo sapiens (Human)
Description:P27487
Residue:766
BDBM50256830
NameBDBM50256830
Synonyms:(S)-1-((S)-2-cyanopyrrolidin-1-yl)-5-((S)-2-(methoxymethyl)pyrrolidin-1-yl)-1,5-dioxopentan-2-aminium 2,2,2-trifluoroacetate | CHEMBL475465
TypeSmall organic molecule
Emp. Form.C16H27N4O3
Mol. Mass.323.41
SMILESCOC[C@@H]1CCCN1C(=O)CC[C@H]([NH3+])C(=O)N1CCC[C@H]1C#N