Reaction Details
TargetGonadotropin-releasing hormone receptor
LigandBDBM50244211
Substrate/Competitorn/a
Meas. Tech.ChEMBL_562458 (CHEMBL1010961)
IC50 40±n/a nM
Citation Pelletier, JCChengalvala, MVCottom, JEFeingold, IBGreen, DMHauze, DBHuselton, CAJetter, JWKopf, GSLundquist, JTMagolda, RLMann, CWMehlmann, JFRogers, JFShanno, LKAdams, WRTio, COWrobel, JE Discovery of 6-({4-[2-(4-tert-butylphenyl)-1H-benzimidazol-4-yl]piperazin-1-yl}methyl)quinoxaline (WAY-207024): an orally active antagonist of the gonadotropin releasing hormone receptor (GnRH-R). J Med Chem52:2148-52 (2009) 
 
Gonadotropin-releasing hormone receptor
Name:Gonadotropin-releasing hormone receptor
Type:PROTEIN
Mol. Mass.:37767.60
Organism:Rattus norvegicus
Description:ChEMBL_1335047
Residue:327
BDBM50244211
NameBDBM50244211
Synonyms:6-((4-(2-(4-tert-butylphenyl)-1H-benzo[d]imidazol-4-yl)piperazin-1-yl)methyl)quinoxaline-2,3(1H,4H)-dione CHEMBL459215
TypeSmall organic molecule
Emp. Form.C30H32N6O2
Mol. Mass.508.6141
SMILESCC(C)(C)c1ccc(cc1)-c1nc2c(cccc2[nH]1)N1CCN(Cc2ccc3[nH]c(=O)c(=O)[nH]c3c2)CC1