Reaction Details
TargetGonadotropin-releasing hormone receptor
LigandBDBM50256939
Substrate/Competitorn/a
Meas. Tech.ChEMBL_562461 (CHEMBL1010964)
IC50 5900±n/a nM
Citation Pelletier, JCChengalvala, MVCottom, JEFeingold, IBGreen, DMHauze, DBHuselton, CAJetter, JWKopf, GSLundquist, JTMagolda, RLMann, CWMehlmann, JFRogers, JFShanno, LKAdams, WRTio, COWrobel, JE Discovery of 6-({4-[2-(4-tert-butylphenyl)-1H-benzimidazol-4-yl]piperazin-1-yl}methyl)quinoxaline (WAY-207024): an orally active antagonist of the gonadotropin releasing hormone receptor (GnRH-R). J Med Chem52:2148-52 (2009) 
 
Gonadotropin-releasing hormone receptor
Name:Gonadotropin-releasing hormone receptor
Type:PROTEIN
Mol. Mass.:37767.60
Organism:Rattus norvegicus
Description:ChEMBL_1335047
Residue:327
BDBM50256939
NameBDBM50256939
Synonyms:5-((4-(2-(4-tert-butylphenyl)-1H-benzo[d]imidazol-4-yl)piperazin-1-yl)methyl)quinoxaline | CHEMBL515123
TypeSmall organic molecule
Emp. Form.C30H32N6
Mol. Mass.476.6153
SMILESCC(C)(C)c1ccc(cc1)-c1nc2c(cccc2[nH]1)N1CCN(Cc2cccc3nccnc23)CC1