Reaction Details
TargetPeroxisome proliferator-activated receptor gamma
LigandBDBM28799
Substrate/Competitorn/a
Meas. Tech.ChEMBL_565041 (CHEMBL959184)
EC50 250±n/a nM
Citation Otero, MPPérez Santín, ERodríguez-Barrios, FVaz, Bde Lera, AR Selective, potent PPARgamma agonists with cyclopentenone core structure. Bioorg Med Chem Lett19:1883-6 (2009) 
 
Peroxisome proliferator-activated receptor gamma
Name:Peroxisome proliferator-activated receptor gamma
Type:Nuclear Receptor
Mol. Mass.:57613.46
Organism:Homo sapiens (Human)
Description:P37231
Residue:505
BDBM28799
NameBDBM28799
Synonyms:2-{[4-(2-{[(2,4-difluorophenyl)carbamoyl](heptyl)amino}ethyl)phenyl]sulfanyl}-2-methylpropanoic acid GW 9578 GW9578
TypeSmall organic molecule
Emp. Form.C26H34F2N2O3S
Mol. Mass.492.622
SMILESCCCCCCCN(CCc1ccc(SC(C)(C)C(O)=O)cc1)C(=O)Nc1ccc(F)cc1F