Reaction Details
TargetDipeptidyl peptidase 4
LigandBDBM50249512
Substrate/Competitorn/a
Meas. Tech.ChEMBL_499548 (CHEMBL1010596)
IC50 7.4±n/a nM
Citation Ammirati, MJAndrews, KMBoyer, DDBrodeur, AMDanley, DEDoran, SDHulin, BLiu, SMcPherson, RKOrena, SJParker, JCPolivkova, JQiu, XSoglia, CBTreadway, JLVanVolkenburg, MAWilder, DCPiotrowski, DW (3,3-Difluoro-pyrrolidin-1-yl)-[(2S,4S)-(4-(4-pyrimidin-2-yl-piperazin-1-yl)-pyrrolidin-2-yl]-methanone: a potent, selective, orally active dipeptidyl peptidase IV inhibitor. Bioorg Med Chem Lett19:1991-5 (2009) 
 
Dipeptidyl peptidase 4
Name:Dipeptidyl peptidase 4
Type:Enzyme
Mol. Mass.:88271.01
Organism:Homo sapiens (Human)
Description:P27487
Residue:766
BDBM50249512
NameBDBM50249512
Synonyms:CHEMBL475573 | cis-(3,3-difluoropyrrolidin-1-yl)((2S,4S)-4-(4-(oxazolo[5,4-c]pyridin-2-yl)piperazin-1-yl)pyrrolidin-2-yl)methanone
TypeSmall organic molecule
Emp. Form.C19H24F2N6O2
Mol. Mass.406.4297
SMILESFC1(F)CCN(C1)C(=O)[C@@H]1C[C@@H](CN1)N1CCN(CC1)c1nc2ccncc2o1