Reaction Details
TargetPotassium voltage-gated channel subfamily A member 3
LigandBDBM50279104
Substrate/Competitorn/a
Meas. Tech.ChEMBL_545452 (CHEMBL1032475)
IC50 4000±n/a nM
Citation Pegoraro, SLang, MDreker, TKraus, JHamm, SMeere, CFeurle, JTasler, SPrütting, SKuras, ZVisan, VGrissmer, S Inhibitors of potassium channels KV1.3 and IK-1 as immunosuppressants. Bioorg Med Chem Lett19:2299-304 (2009) 
 
Potassium voltage-gated channel subfamily A member 3
Name:Potassium voltage-gated channel subfamily A member 3
Type:PROTEIN
Mol. Mass.:63835.47
Organism:Homo sapiens (Human)
Description:ChEMBL_1513935
Residue:575
BDBM50279104
NameBDBM50279104
Synonyms:5-(4-methylbenzoyl)-5H-dibenzo[b,d]azepin-7(6H)-one | CHEMBL522408
TypeSmall organic molecule
Emp. Form.C22H17NO2
Mol. Mass.327.3759
SMILESCc1ccc(cc1)C(=O)N1CC(=O)c2ccccc2-c2ccccc12