Reaction Details
TargetPotassium voltage-gated channel subfamily A member 3
LigandBDBM50279105
Substrate/Competitorn/a
Meas. Tech.ChEMBL_545452 (CHEMBL1032475)
IC50 3400±n/a nM
Citation Pegoraro, SLang, MDreker, TKraus, JHamm, SMeere, CFeurle, JTasler, SPrütting, SKuras, ZVisan, VGrissmer, S Inhibitors of potassium channels KV1.3 and IK-1 as immunosuppressants. Bioorg Med Chem Lett19:2299-304 (2009) 
 
Potassium voltage-gated channel subfamily A member 3
Name:Potassium voltage-gated channel subfamily A member 3
Type:PROTEIN
Mol. Mass.:63835.47
Organism:Homo sapiens (Human)
Description:ChEMBL_1513935
Residue:575
BDBM50279105
NameBDBM50279105
Synonyms:5-(3-chlorobenzoyl)-5H-dibenzo[b,d]azepin-7(6H)-one | CHEMBL497250
TypeSmall organic molecule
Emp. Form.C21H14ClNO2
Mol. Mass.347.794
SMILESClc1cccc(c1)C(=O)N1CC(=O)c2ccccc2-c2ccccc12