Reaction Details
TargetIntermediate conductance calcium-activated potassium channel protein 4
LigandBDBM50279063
Substrate/Competitorn/a
Meas. Tech.ChEMBL_545455 (CHEMBL1032478)
IC50 2100±n/a nM
Citation Pegoraro, SLang, MDreker, TKraus, JHamm, SMeere, CFeurle, JTasler, SPrütting, SKuras, ZVisan, VGrissmer, S Inhibitors of potassium channels KV1.3 and IK-1 as immunosuppressants. Bioorg Med Chem Lett19:2299-304 (2009) 
 
Intermediate conductance calcium-activated potassium channel protein 4
Name:Intermediate conductance calcium-activated potassium channel protein 4
Type:PROTEIN
Mol. Mass.:47723.22
Organism:Homo sapiens (Human)
Description:ChEMBL_1361891
Residue:427
BDBM50279063
NameBDBM50279063
Synonyms:5-tosyl-5H-dibenzo[b,d]azepin-7(6H)-one | CHEMBL498086
TypeSmall organic molecule
Emp. Form.C21H17NO3S
Mol. Mass.363.43
SMILESCc1ccc(cc1)S(=O)(=O)N1CC(=O)c2ccccc2-c2ccccc12