Reaction Details
TargetPotassium voltage-gated channel subfamily A member 3
LigandBDBM50278937
Substrate/Competitorn/a
Meas. Tech.ChEMBL_545452 (CHEMBL1032475)
IC50 7400±n/a nM
Citation Pegoraro, SLang, MDreker, TKraus, JHamm, SMeere, CFeurle, JTasler, SPrütting, SKuras, ZVisan, VGrissmer, S Inhibitors of potassium channels KV1.3 and IK-1 as immunosuppressants. Bioorg Med Chem Lett19:2299-304 (2009) 
 
Potassium voltage-gated channel subfamily A member 3
Name:Potassium voltage-gated channel subfamily A member 3
Type:PROTEIN
Mol. Mass.:63835.47
Organism:Homo sapiens (Human)
Description:ChEMBL_1513935
Residue:575
BDBM50278937
NameBDBM50278937
Synonyms:1-(5-(furan-2-carbonyl)-5,6-dihydrophenanthridin-6-yl)-2-methylpropan-1-one | CHEMBL497085
TypeSmall organic molecule
Emp. Form.C22H19NO3
Mol. Mass.345.3912
SMILESCC(C)C(=O)C1N(C(=O)c2ccco2)c2ccccc2-c2ccccc12