Reaction Details
TargetSphingosine 1-phosphate receptor 3
LigandBDBM50249114
Substrate/Competitorn/a
Meas. Tech.ChEMBL_499714 (CHEMBL980649)
IC50 0.36±n/a nM
Citation Evindar, GSatz, ALBernier, SGKavarana, MJDoyle, ELorusso, JTaghizadeh, NHalley, KHutchings, AKelley, MSWright, ADSaha, AKHannig, GMorgan, BAWestlin, WF Synthesis and evaluation of arylalkoxy- and biarylalkoxy-phenylamide and phenylimidazoles as potent and selective sphingosine-1-phosphate receptor subtype-1 agonists. Bioorg Med Chem Lett19:2315-9 (2009) 
 
Sphingosine 1-phosphate receptor 3
Name:Sphingosine 1-phosphate receptor 3
Type:G Protein-Coupled Receptor (GPCR)
Mol. Mass.:42278.13
Organism:Homo sapiens (Human)
Description:Q99500
Residue:378
BDBM50249114
NameBDBM50249114
Synonyms:(S)-2-amino-2-methyl-3-oxo-3-(4-(5-phenylpentyloxy)phenylamino)propyl dihydrogen phosphate | CHEMBL473156
TypeSmall organic molecule
Emp. Form.C21H29N2O6P
Mol. Mass.436.4385
SMILESC[C@](N)(COP(O)(O)=O)C(=O)Nc1ccc(OCCCCCc2ccccc2)cc1