Reaction Details
TargetSodium-dependent dopamine transporter
LigandBDBM50161646
Substrate/Competitorn/a
Meas. Tech.ChEMBL_566869 (CHEMBL958369)
Ki>10000±n/a nM
Citation Cho, SJJensen, NHKurome, TKadari, SManzano, MLMalberg, JECaldarone, BRoth, BLKozikowski, AP Selective 5-hydroxytryptamine 2C receptor agonists derived from the lead compound tranylcypromine: identification of drugs with antidepressant-like action. J Med Chem52:1885-902 (2009) 
 
Sodium-dependent dopamine transporter
Name:Sodium-dependent dopamine transporter
Type:Multi-pass membrane protein
Mol. Mass.:68497.11
Organism:Homo sapiens (Human)
Description:Q01959
Residue:620
BDBM50161646
NameBDBM50161646
Synonyms:(1R)-8-chloro-2,3,4,5-tetrahydro-1-methyl-1H-3-benzazepine CHEMBL360328 | LORCASERIN
TypeSmall organic molecule
Emp. Form.C11H14ClN
Mol. Mass.195.689
SMILESC[C@H]1CNCCc2ccc(Cl)cc12