Reaction Details
Target5-hydroxytryptamine receptor 2C
LigandBDBM50161646
Substrate/Competitorn/a
Meas. Tech.ChEMBL_566866 (CHEMBL958366)
Ki 257±n/a nM
Citation Cho, SJJensen, NHKurome, TKadari, SManzano, MLMalberg, JECaldarone, BRoth, BLKozikowski, AP Selective 5-hydroxytryptamine 2C receptor agonists derived from the lead compound tranylcypromine: identification of drugs with antidepressant-like action. J Med Chem52:1885-902 (2009) 
 
5-hydroxytryptamine receptor 2C
Name:5-hydroxytryptamine receptor 2C
Type:G Protein-Coupled Receptor (GPCR)
Mol. Mass.:51836.79
Organism:Homo sapiens (Human)
Description:P28335
Residue:458
BDBM50161646
NameBDBM50161646
Synonyms:(1R)-8-chloro-2,3,4,5-tetrahydro-1-methyl-1H-3-benzazepine CHEMBL360328 | LORCASERIN
TypeSmall organic molecule
Emp. Form.C11H14ClN
Mol. Mass.195.689
SMILESC[C@H]1CNCCc2ccc(Cl)cc12