Reaction Details
TargetSodium-dependent serotonin transporter
LigandBDBM50256779
Substrate/Competitorn/a
Meas. Tech.ChEMBL_566867 (CHEMBL958367)
Ki 1042±n/a nM
Citation Cho, SJJensen, NHKurome, TKadari, SManzano, MLMalberg, JECaldarone, BRoth, BLKozikowski, AP Selective 5-hydroxytryptamine 2C receptor agonists derived from the lead compound tranylcypromine: identification of drugs with antidepressant-like action. J Med Chem52:1885-902 (2009) 
 
Sodium-dependent serotonin transporter
Name:Sodium-dependent serotonin transporter
Type:Multi-pass membrane protein
Mol. Mass.:70322.51
Organism:Homo sapiens (Human)
Description:P31645
Residue:630
BDBM50256779
NameBDBM50256779
Synonyms:CHEMBL451232 | trans-[2-(2-Chloro-4-fluorophenyl)cyclopropyl]methylamine Hydrochloride
TypeSmall organic molecule
Emp. Form.C10H11ClFN
Mol. Mass.199.652
SMILESNC[C@H]1C[C@@H]1c1ccc(F)cc1Cl