Reaction Details
TargetProtein kinase C alpha type
LigandBDBM50278836
Substrate/Competitorn/a
Meas. Tech.ChEMBL_565654 (CHEMBL959250)
IC50 40±n/a nM
Citation Seefeld, MARouse, MBMcNulty, KCSun, LWang, JYamashita, DSLuengo, JIZhang, SMinthorn, EAConcha, NOHeerding, DA Discovery of 5-pyrrolopyridinyl-2-thiophenecarboxamides as potent AKT kinase inhibitors. Bioorg Med Chem Lett19:2244-8 (2009) 
 
Protein kinase C alpha type
Name:Protein kinase C alpha type
Type:Enzyme
Mol. Mass.:76755.65
Organism:Homo sapiens (Human)
Description:The recombinant human PKC enzymes were produced using a baculovirus expression system in SF9 cells
Residue:672
BDBM50278836
NameBDBM50278836
Synonyms:CHEMBL523586 | N-((S)-1-amino-3-(3-fluorophenyl)propan-2-yl)-4-bromo-5-(1H-pyrrolo[2,3-b]pyridin-4-yl)thiophene-2-carboxamide
TypeSmall organic molecule
Emp. Form.C21H18BrFN4OS
Mol. Mass.473.361
SMILESNC[C@H](Cc1cccc(F)c1)NC(=O)c1cc(Br)c(s1)-c1ccnc2[nH]ccc12