Reaction Details
TargetRAC-alpha serine/threonine-protein kinase
LigandBDBM50278569
Substrate/Competitorn/a
Meas. Tech.ChEMBL_565646 (CHEMBL959242)
IC50 25±n/a nM
Citation Seefeld, MARouse, MBMcNulty, KCSun, LWang, JYamashita, DSLuengo, JIZhang, SMinthorn, EAConcha, NOHeerding, DA Discovery of 5-pyrrolopyridinyl-2-thiophenecarboxamides as potent AKT kinase inhibitors. Bioorg Med Chem Lett19:2244-8 (2009) 
 
RAC-alpha serine/threonine-protein kinase
Name:RAC-alpha serine/threonine-protein kinase
Type:Enzyme
Mol. Mass.:55681.25
Organism:Homo sapiens (Human)
Description:P31749
Residue:480
BDBM50278569
NameBDBM50278569
Synonyms:3-amino-N-(4-bromo-5-(1H-pyrrolo[2,3-b]pyridin-4-yl)thiophen-2-yl)-2-phenylpropanamide | CHEMBL472291
TypeSmall organic molecule
Emp. Form.C20H17BrN4OS
Mol. Mass.441.344
SMILESNCC(C(=O)Nc1cc(Br)c(s1)-c1ccnc2[nH]ccc12)c1ccccc1