Reaction Details
TargetRAC-alpha serine/threonine-protein kinase
LigandBDBM50278690
Substrate/Competitorn/a
Meas. Tech.ChEMBL_565646 (CHEMBL959242)
IC50 20±n/a nM
Citation Seefeld, MARouse, MBMcNulty, KCSun, LWang, JYamashita, DSLuengo, JIZhang, SMinthorn, EAConcha, NOHeerding, DA Discovery of 5-pyrrolopyridinyl-2-thiophenecarboxamides as potent AKT kinase inhibitors. Bioorg Med Chem Lett19:2244-8 (2009) 
 
RAC-alpha serine/threonine-protein kinase
Name:RAC-alpha serine/threonine-protein kinase
Type:Enzyme
Mol. Mass.:55681.25
Organism:Homo sapiens (Human)
Description:P31749
Residue:480
BDBM50278690
NameBDBM50278690
Synonyms:4-bromo-N-(2-(dimethylamino)-1-phenylethyl)-5-(1H-pyrrolo[2,3-b]pyridin-4-yl)thiophene-2-carboxamide | CHEMBL470620
TypeSmall organic molecule
Emp. Form.C22H21BrN4OS
Mol. Mass.469.397
SMILESCN(C)CC(NC(=O)c1cc(Br)c(s1)-c1ccnc2[nH]ccc12)c1ccccc1