Reaction Details
TargetRAC-beta serine/threonine-protein kinase
LigandBDBM50278834
Substrate/Competitorn/a
Meas. Tech.ChEMBL_565649 (CHEMBL959245)
IC50 63±n/a nM
Citation Seefeld, MARouse, MBMcNulty, KCSun, LWang, JYamashita, DSLuengo, JIZhang, SMinthorn, EAConcha, NOHeerding, DA Discovery of 5-pyrrolopyridinyl-2-thiophenecarboxamides as potent AKT kinase inhibitors. Bioorg Med Chem Lett19:2244-8 (2009) 
 
RAC-beta serine/threonine-protein kinase
Name:RAC-beta serine/threonine-protein kinase
Type:Enzyme
Mol. Mass.:55766.64
Organism:Homo sapiens (Human)
Description:n/a
Residue:481
BDBM50278834
NameBDBM50278834
Synonyms:CHEMBL524998 | N-((S)-1-amino-3-(4-methoxyphenyl)propan-2-yl)-4-bromo-5-(1H-pyrrolo[2,3-b]pyridin-4-yl)thiophene-2-carboxamide
TypeSmall organic molecule
Emp. Form.C22H21BrN4O2S
Mol. Mass.485.397
SMILESCOc1ccc(C[C@@H](CN)NC(=O)c2cc(Br)c(s2)-c2ccnc3[nH]ccc23)cc1