Reaction Details
TargetHistone deacetylase 5
LigandBDBM50278220
Substrate/Competitorn/a
Meas. Tech.ChEMBL_565677 (CHEMBL960035)
IC50 1160±n/a nM
Citation Giannini, GMarzi, MPezzi, RBrunetti, TBattistuzzi, GMarzo, MDCabri, WVesci, LPisano, C N-Hydroxy-(4-oxime)-cinnamide: a versatile scaffold for the synthesis of novel histone deacetylase [correction of deacetilase] (HDAC) inhibitors. Bioorg Med Chem Lett19:2346-9 (2009) 
 
Histone deacetylase 5
Name:Histone deacetylase 5
Type:Enzyme
Mol. Mass.:121968.61
Organism:Homo sapiens (Human)
Description:Q9UQL6
Residue:1122
BDBM50278220
NameBDBM50278220
Synonyms:CHEMBL471042 ST-2987
TypeSmall organic molecule
Emp. Form.C17H15N3O5
Mol. Mass.341.3181
SMILESONC(=O)\C=C\c1ccc(\C=N\OCc2ccc(cc2)[N+]([O-])=O)cc1