Reaction Details
TargetHistone deacetylase 6
LigandBDBM50278220
Substrate/Competitorn/a
Meas. Tech.ChEMBL_565678 (CHEMBL960036)
IC50 124±n/a nM
Citation Giannini, GMarzi, MPezzi, RBrunetti, TBattistuzzi, GMarzo, MDCabri, WVesci, LPisano, C N-Hydroxy-(4-oxime)-cinnamide: a versatile scaffold for the synthesis of novel histone deacetylase [correction of deacetilase] (HDAC) inhibitors. Bioorg Med Chem Lett19:2346-9 (2009) 
 
Histone deacetylase 6
Name:Histone deacetylase 6
Type:Chromatin regulator; hydrolase; repressor
Mol. Mass.:131381.51
Organism:Homo sapiens (Human)
Description:Q9UBN7
Residue:1215
BDBM50278220
NameBDBM50278220
Synonyms:CHEMBL471042 ST-2987
TypeSmall organic molecule
Emp. Form.C17H15N3O5
Mol. Mass.341.3181
SMILESONC(=O)\C=C\c1ccc(\C=N\OCc2ccc(cc2)[N+]([O-])=O)cc1