Reaction Details
TargetHistone deacetylase 3
LigandBDBM50278221
Substrate/Competitorn/a
Meas. Tech.ChEMBL_565675 (CHEMBL960033)
IC50 659±n/a nM
Citation Giannini, GMarzi, MPezzi, RBrunetti, TBattistuzzi, GMarzo, MDCabri, WVesci, LPisano, C N-Hydroxy-(4-oxime)-cinnamide: a versatile scaffold for the synthesis of novel histone deacetylase [correction of deacetilase] (HDAC) inhibitors. Bioorg Med Chem Lett19:2346-9 (2009) 
 
Histone deacetylase 3
Name:Histone deacetylase 3
Type:Enzyme
Mol. Mass.:48829.55
Organism:Homo sapiens (Human)
Description:O15379
Residue:428
BDBM50278221
NameBDBM50278221
Synonyms:CHEMBL471043 | methyl 4-((4-(3-(hydroxyamino)-3-oxoprop-1-enyl)benzylideneaminooxy)methyl)benzoate
TypeSmall organic molecule
Emp. Form.C19H18N2O5
Mol. Mass.354.3566
SMILESCOC(=O)c1ccc(CO\N=C\c2ccc(\C=C\C(=O)NO)cc2)cc1