Reaction Details
TargetHistone deacetylase 3
LigandBDBM50278344
Substrate/Competitorn/a
Meas. Tech.ChEMBL_565675 (CHEMBL960033)
IC50 3140±n/a nM
Citation Giannini, GMarzi, MPezzi, RBrunetti, TBattistuzzi, GMarzo, MDCabri, WVesci, LPisano, C N-Hydroxy-(4-oxime)-cinnamide: a versatile scaffold for the synthesis of novel histone deacetylase [correction of deacetilase] (HDAC) inhibitors. Bioorg Med Chem Lett19:2346-9 (2009) 
 
Histone deacetylase 3
Name:Histone deacetylase 3
Type:Enzyme
Mol. Mass.:48829.55
Organism:Homo sapiens (Human)
Description:O15379
Residue:428
BDBM50278344
NameBDBM50278344
Synonyms:CHEMBL470843 | N-hydroxy-3-(4-(5-(morpholinomethyl)isoxazol-3-yl)phenyl)acrylamide hydrochloride
TypeSmall organic molecule
Emp. Form.C17H19N3O4
Mol. Mass.329.3505
SMILESONC(=O)\C=C\c1ccc(cc1)-c1cc(CN2CCOCC2)on1