Reaction Details
TargetHistone deacetylase 8
LigandBDBM50278344
Substrate/Competitorn/a
Meas. Tech.ChEMBL_565680 (CHEMBL960038)
IC50 127±n/a nM
Citation Giannini, GMarzi, MPezzi, RBrunetti, TBattistuzzi, GMarzo, MDCabri, WVesci, LPisano, C N-Hydroxy-(4-oxime)-cinnamide: a versatile scaffold for the synthesis of novel histone deacetylase [correction of deacetilase] (HDAC) inhibitors. Bioorg Med Chem Lett19:2346-9 (2009) 
 
Histone deacetylase 8
Name:Histone deacetylase 8
Type:Enzyme
Mol. Mass.:41749.60
Organism:Homo sapiens (Human)
Description:Q9BY41
Residue:377
BDBM50278344
NameBDBM50278344
Synonyms:CHEMBL470843 | N-hydroxy-3-(4-(5-(morpholinomethyl)isoxazol-3-yl)phenyl)acrylamide hydrochloride
TypeSmall organic molecule
Emp. Form.C17H19N3O4
Mol. Mass.329.3505
SMILESONC(=O)\C=C\c1ccc(cc1)-c1cc(CN2CCOCC2)on1