Reaction Details
TargetHistone deacetylase 8
LigandBDBM50278219
Substrate/Competitorn/a
Meas. Tech.ChEMBL_565680 (CHEMBL960038)
IC50 1290±n/a nM
Citation Giannini, GMarzi, MPezzi, RBrunetti, TBattistuzzi, GMarzo, MDCabri, WVesci, LPisano, C N-Hydroxy-(4-oxime)-cinnamide: a versatile scaffold for the synthesis of novel histone deacetylase [correction of deacetilase] (HDAC) inhibitors. Bioorg Med Chem Lett19:2346-9 (2009) 
 
Histone deacetylase 8
Name:Histone deacetylase 8
Type:Enzyme
Mol. Mass.:41749.60
Organism:Homo sapiens (Human)
Description:Q9BY41
Residue:377
BDBM50278219
NameBDBM50278219
Synonyms:CHEMBL471041 ST-2986
TypeSmall organic molecule
Emp. Form.C17H11F5N2O3
Mol. Mass.386.2729
SMILESONC(=O)\C=C\c1ccc(\C=N\OCc2c(F)c(F)c(F)c(F)c2F)cc1