Reaction Details
TargetDipeptidyl peptidase 4
LigandBDBM50278839
Substrate/Competitorn/a
Meas. Tech.ChEMBL_501197 (CHEMBL975310)
IC50 272±n/a nM
Citation Benbow, JWAndrews, KAAubrecht, JBeebe, DBoyer, DDoran, SHomiski, MHui, YMcPherson, KParker, JCTreadway, JVanvolkenberg, MZembrowski, WJ Piperidinyl-2-phenethylamino inhibitors of DPP-IV for the treatment of type 2 diabetes. Bioorg Med Chem Lett19:2220-3 (2009) 
 
Dipeptidyl peptidase 4
Name:Dipeptidyl peptidase 4
Type:Enzyme
Mol. Mass.:88271.01
Organism:Homo sapiens (Human)
Description:P27487
Residue:766
BDBM50278839
NameBDBM50278839
Synonyms:(R)-1-(piperidin-4-yl)-2-(2,4,5-trifluorophenyl)ethanamine | CHEMBL451619
TypeSmall organic molecule
Emp. Form.C13H17F3N2
Mol. Mass.258.2827
SMILESN[C@H](Cc1cc(F)c(F)cc1F)C1CCNCC1