Reaction Details
TargetDipeptidyl peptidase 4
LigandBDBM50278842
Substrate/Competitorn/a
Meas. Tech.ChEMBL_501197 (CHEMBL975310)
IC50 26±n/a nM
Citation Benbow, JWAndrews, KAAubrecht, JBeebe, DBoyer, DDoran, SHomiski, MHui, YMcPherson, KParker, JCTreadway, JVanvolkenberg, MZembrowski, WJ Piperidinyl-2-phenethylamino inhibitors of DPP-IV for the treatment of type 2 diabetes. Bioorg Med Chem Lett19:2220-3 (2009) 
 
Dipeptidyl peptidase 4
Name:Dipeptidyl peptidase 4
Type:Enzyme
Mol. Mass.:88271.01
Organism:Homo sapiens (Human)
Description:P27487
Residue:766
BDBM50278842
NameBDBM50278842
Synonyms:(R)-(4-(1-amino-2-(2,4,5-trifluorophenyl)ethyl)piperidin-1-yl)(isoquinolin-3-yl)methanone | CHEMBL498749
TypeSmall organic molecule
Emp. Form.C23H22F3N3O
Mol. Mass.413.4355
SMILESN[C@H](Cc1cc(F)c(F)cc1F)C1CCN(CC1)C(=O)c1cc2ccccc2cn1