Reaction Details
TargetHistamine H3 receptor
LigandBDBM50278444
Substrate/Competitorn/a
Meas. Tech.ChEMBL_501237 (CHEMBL975272)
Ki 0.28±n/a nM
Citation Isensee, KAmon, MGarlapati, AGalaparti, ALigneau, XCamelin, JCCapet, MSchwartz, JCStark, H Fluorinated non-imidazole histamine H3 receptor antagonists. Bioorg Med Chem Lett19:2172-5 (2009) 
 
Histamine H3 receptor
Name:Histamine H3 receptor
Type:G Protein-Coupled Receptor (GPCR)
Mol. Mass.:48691.47
Organism:Homo sapiens (Human)
Description:Binding assays were using CHO cells stably expressing hH3R receptors.
Residue:445
BDBM50278444
NameBDBM50278444
Synonyms:(R)-1-(3-(4-((3-fluoropyrrolidin-1-yl)methyl)phenoxy)propyl)piperidine | CHEMBL470599
TypeSmall organic molecule
Emp. Form.C19H29FN2O
Mol. Mass.320.4448
SMILESF[C@@H]1CCN(Cc2ccc(OCCCN3CCCCC3)cc2)C1