Reaction Details
TargetHistamine H3 receptor
LigandBDBM50278446
Substrate/Competitorn/a
Meas. Tech.ChEMBL_501237 (CHEMBL975272)
Ki 0.31±n/a nM
Citation Isensee, KAmon, MGarlapati, AGalaparti, ALigneau, XCamelin, JCCapet, MSchwartz, JCStark, H Fluorinated non-imidazole histamine H3 receptor antagonists. Bioorg Med Chem Lett19:2172-5 (2009) 
 
Histamine H3 receptor
Name:Histamine H3 receptor
Type:G Protein-Coupled Receptor (GPCR)
Mol. Mass.:48691.47
Organism:Homo sapiens (Human)
Description:Binding assays were using CHO cells stably expressing hH3R receptors.
Residue:445
BDBM50278446
NameBDBM50278446
Synonyms:(R)-3-fluoro-1-(4-(3-(pyrrolidin-1-yl)propoxy)benzyl)pyrrolidine | CHEMBL452877
TypeSmall organic molecule
Emp. Form.C18H27FN2O
Mol. Mass.306.4182
SMILESF[C@@H]1CCN(Cc2ccc(OCCCN3CCCC3)cc2)C1