Reaction Details
TargetHistamine H3 receptor
LigandBDBM50278449
Substrate/Competitorn/a
Meas. Tech.ChEMBL_501237 (CHEMBL975272)
Ki 0.2±n/a nM
Citation Isensee, KAmon, MGarlapati, AGalaparti, ALigneau, XCamelin, JCCapet, MSchwartz, JCStark, H Fluorinated non-imidazole histamine H3 receptor antagonists. Bioorg Med Chem Lett19:2172-5 (2009) 
 
Histamine H3 receptor
Name:Histamine H3 receptor
Type:G Protein-Coupled Receptor (GPCR)
Mol. Mass.:48691.47
Organism:Homo sapiens (Human)
Description:Binding assays were using CHO cells stably expressing hH3R receptors.
Residue:445
BDBM50278449
NameBDBM50278449
Synonyms:4-bromo-1-(4-(3-(piperidin-1-yl)propoxy)benzyl)piperidine | CHEMBL472466
TypeSmall organic molecule
Emp. Form.C20H31BrN2O
Mol. Mass.395.377
SMILESBrC1CCN(Cc2ccc(OCCCN3CCCCC3)cc2)CC1