Reaction Details
TargetAndrogen receptor
LigandBDBM25428
Substrate/Competitorn/a
Meas. Tech.ChEMBL_501560 (CHEMBL987689)
IC50 16±n/a nM
Citation Mitchell, LHHu, LYNguyen, MFakhoury, SSmith, YIula, DKostlan, CCarroll, MDettling, DDu, DPocalyko, DWade, KLefker, B Diphenyl ethers as androgen receptor antagonists for the topical suppression of sebum production. Bioorg Med Chem Lett19:2176-8 (2009) 
 
Androgen receptor
Name:Androgen receptor
Type:Receptor
Mol. Mass.:99185.27
Organism:Homo sapiens (Human)
Description:CHO cells were stably transfected with human AR gene.
Residue:920
BDBM25428
NameBDBM25428
Synonyms:4-[3-(4-hydroxybutyl)-4,4-dimethyl-2,5-dioxoimidazolidin-1-yl]-2-(trifluoromethyl)benzonitrile RU-58841
TypeSmall organic molecule
Emp. Form.C17H18F3N3O3
Mol. Mass.369.3383
SMILESCC1(C)N(CCCCO)C(=O)N(C1=O)c1ccc(C#N)c(c1)C(F)(F)F