Reaction Details
TargetEpidermal growth factor receptor
LigandBDBM50278650
Substrate/Competitorn/a
Meas. Tech.ChEMBL_501564 (CHEMBL987693)
IC50 13±n/a nM
Citation Lin, RJohnson, SGConnolly, PJWetter, SKBinnun, EHughes, TVMurray, WVPandey, NBMoreno-Mazza, SJAdams, MFuentes-Pesquera, ARMiddleton, SA Synthesis and evaluation of 2,7-diamino-thiazolo[4,5-d] pyrimidine analogues as anti-tumor epidermal growth factor receptor (EGFR) tyrosine kinase inhibitors. Bioorg Med Chem Lett19:2333-7 (2009) 
 
Epidermal growth factor receptor
Name:Epidermal growth factor receptor
Type:Receptor Kinase Domain
Mol. Mass.:134279.59
Organism:Homo sapiens (Human)
Description:P00533
Residue:1210
BDBM50278650
NameBDBM50278650
Synonyms:CHEMBL470218 | N7-(3-chloro-4-fluorophenyl)-N2-(4-(2-(dimethylamino)ethyl)phenyl)thiazolo[4,5-d]pyrimidine-2,7-diamine
TypeSmall organic molecule
Emp. Form.C21H20ClFN6S
Mol. Mass.442.94
SMILESCN(C)CCc1ccc(Nc2nc3ncnc(Nc4ccc(F)c(Cl)c4)c3s2)cc1